发表评论取消回复
相关阅读
相关 Android ADB安装apk失败:INSTALL_FAILED_TEST_ONLY
droid ADB安装apk失败:INSTALL\_FAILED\_TEST\_ONLY 解决: 1、一种是在代码里面加, > 在gradle.properties配置文
相关 Server springMVC-test failed to start.
文章目录 spring MVC项目启动时报Server springMVC-test failed to start.错误 spring MVC项目启动时
相关 Tensorflow GPU 安装可能遇到的问题: GPU test failed
安装Tensorflow gpu失败很有可能是cuda toolkit适配不对,最主要是cudatoolkit和cudnn版本问题,此处提供一个范本,若要安装版本更低的,去官网
相关 gifslice pre-build test failed
一般情况下是连接不上 raw.githubusercontent.com 解决方法: 打开 http://tool.chinaz.com/dns ,这是一个查询域名映射关
相关 Test run failed:Unable to find instrumentation target package
13.Andriod 单元测试 Test run failed:Unable to find instrumentation target package的问题 (
相关 Test running failed: Unable to find instrumentation info for: ComponentInfo
在使用android studio进行单元测试的时候报错 Test running failed: Unable to find instrumentation
相关 INSTALL_FAILED_TEST_ONLY的原因
有一天给测试同学打了个deubg 包发现无法安装,提示无法解析,使用adb install 安装后提示`INSTALL_FAILED_TEST_ONLY`,原来是`Androi
相关 Android Studio 3.3.2 INSTALL_FAILED_TEST_ONLY
安装最新版本的Andorid Studio之后,我调试用的一直是 360N7 lite(Android 8.0 API 27),然后现在要测试兼容性,换了一台 联想乐檬3s(A
相关 Failed to execute goal org.apache.maven.plugins:maven-surefire-plugin:2.22.1:test (default-test)
> springboot打包出现错误 正文 在进行springboot打包时,打包不成功 错误描述 Failed to execute goal or
相关 PowerDesiger Conncetion test failed!
PowerDesiger Conncetion test failed! PowerDesiger 反向工程中是需要配置的起码12.5版本对JDBC的支持是
还没有评论,来说两句吧...